{"text_format":"1","workbook":"xlsx","n_sheets":11,"sheets":["Instrucciones","Características datos","InfoBase 6B2a","InfoBase 6B2b(población)","InfoBase 6B2b","InfoProc 6B2a","Prop. y Fact. de conversión","FE 6B2","Emisiones GEI 6B2a","Emisiones GEI 6B2b","Resultados INGEI"],"not_rendered":{"charts":2,"images":27,"macros":1,"external_links":0,"defined_names":1,"comments":2,"pivot_tables":0},"unopened":[],"bounds":{"document_bytes":16777216,"sheet_cells":100000,"rows_first":2000,"rows_last":500,"rows_between":2000,"halvings":0,"cell_chars":16384,"cell_head_chars":4096},"cells_cut":0,"cells_raw":0,"read":"whole","date_system":"1900"}

{"sheet":"Instrucciones","index":0,"n_rows":72,"n_cols":6,"rows_kept":72,"cut":false,"hidden":false,"merged":[[64,1,64,17],[23,5,23,17],[24,5,25,17],[26,5,26,17],[29,1,29,17],[32,2,32,8],[33,2,33,8],[34,2,34,8],[35,2,35,8],[36,2,36,8],[37,2,37,8],[38,2,38,8],[10,1,10,6],[1,1,1,17],[2,1,2,17],[13,1,13,17],[4,1,4,17],[6,1,6,17],[7,1,8,13]]}
[]
[null,"INVENTARIO NACIONAL DE GASES DE EFECTO INVERNADERO - AÑO BASE 2010"]
[null,"Sector Desechos - Subcategoría de Tratamiento y eliminación de aguas residuales domésticas"]
[]
[null,"INSTRUCCIONES "]
[]
[null,"ALCANCE"]
[null,"La subcategoría de Tratamiento y eliminación de aguas residuales domésticas, involucra a todas las emisiones de gases de efecto invernadero que se generan por la descomposición de aguas residuales domésticas en condiciones anaeróbicas. Se contabilizan además las emisiones procedentes de las excretas humanas."]
[]
[]
[null,"El Tratamiento y eliminación de aguas residuales domésticas, comprende las siguientes fuentes:\n\n- Aguas residuales domésticas. \n- Excretas humanas"]
[]
[]
[null,"METODOLOGÍA DE CALCULO"]
[]
[null,"Directrices del IPCC para Inventarios Nacionales del IPCC - 1996 (GL 1996) en lo que respecta a aguas residuales"]
[null,"Orientación del IPCC sobre las buenas prácticas y la gestión de la incertidumbre en los inventarios nacionales de Gases de Efecto Invernadero (OBP 2000)"]
[null,"Sector: Desechos"]
[null,null,null,null,null,"Para el cálculo de Emisiones GEI:"]
[]
{"$rows_left_out":53}
{"sheet":"Características datos","index":1,"n_rows":17,"n_cols":15,"rows_kept":17,"cut":false,"hidden":false,"merged":[[15,11,16,11],[15,12,16,12],[10,1,14,1],[10,2,14,2],[10,3,14,3],[10,4,14,4],[15,1,16,1],[15,2,16,2],[15,3,16,3],[15,4,16,4],[10,11,12,11],[10,12,14,12],[10,14,11,14],[13,11,14,11],[13,14,14,14],[1,1,1,14],[6,1,6,4],[10,5,14,5],[10,6,14,6],[15,5,16,5],[15,6,16,6]]}
[]
[null,"Caracterización de Datos - Sector Desechos (Residuos sólidos)"]
[null,"Definición IPCC: se refiere a la definición -literal o abreviada- de las GL1996. En algunos casos la definición abreviada se acompaña de un comentario (columna G) con la definición literal"]
[null,"Definición INGEI: se refiere a la definición de las GL1996, ajustada a la realidad o circunstancias del Perú. Este ajuste se identificó en el desarrollo del INGEI y mantiene el concepto general de la definición original en las GL1996"]
[null,null,"No aplica o no se considera en este INGEI"]
[]
[null,"Categorización",null,null,null,"Fuente de emisión / captura","Definición","Nivel de actividad","Unidad","TIER/Nivel","Fuente de información","Uso de la información","Gases de GEI generados por el nivel de actividad","Comentarios","Hojas relacionada"]
[null,6,null,null,null,"Desechos"]
[null,null,"6B",null,null,"Tratamiento de aguas residuales","Definición IPCC: Metano y óxido nitroso generados por la descomposición de materia orgánica en las aguas.residuales.\nDefinición INGEI: metano y óxido nitroso generados por la descomposición de materia orgánica en las aguas residuales industriales y domésticas ."]
[null,null,null,"6B2",null,"Tratamiento y eliminación de aguas residuales domésticas","Definición IPCC: Emisiones de metano que se generan en los tratamientos de aguas residuales y lodos procedentes de las viviendas y fuentes comerciales. Se consideran además las emisiones de oxido nitroso procedentes de las excretas humanas vertidas en ambientes acuáticos. \n\nDefinición INGEI: Emisiones de metano generadas en los procesos de tratamiento de aguas residuales domésticas."]
[null,null,null,null,"6B2a","Aguas residuales domésticas","Definición IPCC: Manejo de aguas residuales y lodo, de fuentes domésticas y comerciales (incluyendo residuos humanos), a través de la recolección y tratamiento de aguas residuales, letrinas o descarga en fuentes de agua. \n\nDefinición INGEI: Emisiones de metano generadas en los procesos de tratamiento de aguas residuales domésticas, considerando los vertimientos al alcatarillado público.","Población con sistema de alcantarillado","número de personas en miles",1,"Superintendencia Nacional de Servicios de Saneamiento (SUNASS)","Sirven para determinar en su conjunto las emisiones de metano generadas por el tratamiento de las aguas residuales domésticas.","CH4",null,"InfoProc 6B2a"]
[null,null,null,null,null,null,null,"Porcentaje de aguas residuales tratadas","%",1,"Superintendencia Nacional de Servicios de Saneamiento (SUNASS)"]
[null,null,null,null,null,null,null,"Demanda Biológica de Oxígeno (DBO)","Kg DBO/1000 pesonas∙año",1,"Reglamento Nacional de Edificaciones – Norma OS.090: Plantas de Tratamiento de Aguas Residuales. (Debe hacerse un ajuste para llevarlo a las unidades requeridas).",null,null,null,"Prop. y Fact. de conversión\n"]
[null,null,null,null,null,null,null,"Población del ámbito de la EPS","número de personas en miles",1,"Superintendencia Nacional de Servicios de Saneamiento (SUNASS)","La población de ámbito de la EPS y el Porcentaje de cobertura de alcantarillado, son usados para estimar la Población con sistema de alcantarillado, en caso esta información no está disponible:\nPoblación con sistema de alcantarillado = Población de ámbito de la EPS x  Porcentaje de cobertura de alcantarillado",null,null,"InfoBase 6B2a"]
[null,null,null,null,null,null,null,"Porcentaje de cobertura de alcantarillado","%",1,"Superintendencia Nacional de Servicios de Saneamiento (SUNASS)"]
[null,null,null,null,"6B2b","Excretas humanas","Definición IPCC: Las emisiones de N2O de las excretas humanas, están directamente relacionadas al ciclo del nitrógeno en la Agricultura. \n\nDefinición INGEI: se considera las emisiones indirectas de N2O por la ingesta de proteinas en la población. Estas emisiones no son consideradas en Agricultura y forman parte de las \"Aguas residuales domésticas\", que solo contabilizan CH4.","Población nacional","número de personas en miles",null,"Instituto Nacional de Estadísticas e Informática (INEI)","Sirve para determinar la cantidad de nitrógeno contenida en la orina humana","N2O",null,"infoBase6B2b(población)"]
[null,null,null,null,null,null,null,"Consumo de proteínas","g/persona∙día",1,"Organización de las Naciones Unidas para la Agricultura y la Alimentación (FAO)",null,null,null,"InfoBase 6B2b"]

{"sheet":"InfoBase 6B2a","index":2,"n_rows":71,"n_cols":12,"rows_kept":71,"cut":false,"hidden":false,"merged":[[18,3,19,3],[18,1,19,1],[18,5,19,5],[18,6,19,6],[18,2,19,2],[1,1,1,9],[3,1,3,9],[4,2,4,9],[9,3,9,9],[10,3,10,4],[10,6,10,7],[5,2,5,9],[6,1,9,1],[6,3,6,9],[7,3,7,9],[8,3,8,9],[11,2,11,9],[13,1,14,1],[13,2,13,9],[14,2,14,9],[11,1,12,1],[12,2,12,9]]}
[]
[null,"Información Básica: Feacción de aguas residuales que son tratadas"]
[]
[null,"DATOS DE LA INFORMACIÓN BASE"]
[null,"Código","6B"]
[null,"Subcodigo ","6B2a"]
[null,"Información ","Nivel de actividad","Porcentaje a nivel nacional de las aguas tratadas"]
[null,null,"Documento","Las EPS y su desarrollo 2013 - Datos 2010"]
[null,null,"Título ","Fracción de agua residual tratada"]
[null,null,"Subtitulo"]
[null,"Ubicación especifica","Pagina",18,null,"Cuadro",null,null,"Anexo "]
[null,"Vínculo","http://www.sunass.gob.pe/doc/eps_desarrollo_2013.pdf"]
[null,null,"Visitado en mayo 2015"]
[null,"Institución ","Superintendencia Nacional de Servicios de Saneamiento (SUNASS)"]
[]
[]
[]
[null,null,null,null,null,null,null,null,null,null,null,"Relación de esta hoja, con otras:"]
[null,"Código","Región","Empresa Prestadora de Servicio","Tratamiento de aguas residuales","Población ámbito EPS","Población con alcantarillado"]
[null,null,null,null,2010]
{"$rows_left_out":52}
{"sheet":"InfoBase 6B2b(población)","index":3,"n_rows":18,"n_cols":9,"rows_kept":18,"cut":false,"hidden":false,"merged":[[13,1,14,1],[13,2,13,9],[14,2,14,9],[10,3,10,4],[10,6,10,7],[11,2,11,9],[11,1,12,1],[12,2,12,9],[1,1,1,9],[3,1,3,9],[4,2,4,9],[5,2,5,9],[6,1,9,1],[6,3,6,9],[7,3,7,9],[8,3,8,9],[9,3,9,9]]}
[]
[null,"Información Básica: Población nacional según región"]
[]
[null,"DATOS DE LA INFORMACIÓN BASE"]
[null,"Código","6A y 6B2"]
[null,"Subcodigo "]
[null,"Información ","Nivel de actividad","Población según región/provincia/distrito"]
[null,null,"Documento","-"]
[null,null,"Título ","Poblaciónal 2010"]
[null,null,"Subtitulo"]
[null,"Ubicación especifica","Pagina",null,null,"Cuadro",null,null,"Anexo "]
[null,"Vínculo","http://proyectos.inei.gob.pe/web/poblacion/#"]
[null,null,"Visitado en mayo 2015"]
[null,"Institución ","Instituto Nacional de Estadísticas e Informática"]
[]
[]
[]
[null,null,"Población total oficial del Perú:",29461933,null,null,null,"Relación de esta hoja, con otras:"]

{"sheet":"InfoBase 6B2b","index":4,"n_rows":17,"n_cols":9,"rows_kept":17,"cut":false,"hidden":false,"merged":[[1,1,1,9],[3,1,3,9],[4,2,4,9],[5,2,5,9],[6,1,9,1],[6,3,6,9],[7,3,7,9],[8,3,8,9],[9,3,9,9],[16,1,16,2],[10,3,10,4],[10,6,10,7],[11,2,11,9],[13,1,14,1],[13,2,13,9],[14,2,14,9],[11,1,12,1],[12,2,12,9]]}
[]
[null,"Consumo diario de proteínas"]
[]
[null,"DATOS DE LA INFORMACIÓN BASE"]
[null,"Código","6B"]
[null,"Subcodigo ","6B2a"]
[null,"Información ","Nivel de actividad","Consumo de proteína per cápita"]
[null,null,"Documento","Perfil de País: Indicadores de Seguridad Alimentaria"]
[null,null,"Título ","Suministro Alimentario para el Consumo Humano"]
[null,null,"Subtitulo","Consumo total de proteínas"]
[null,"Ubicación especifica","Pagina",1,null,"Cuadro",null,null,"Anexo "]
[null,"Vínculo","http://www.fao.org/fileadmin/templates/ess/documents/food_security_statistics/country_profiles/esp/Peru_S.pdf"]
[null,null,"Visitado en mayo 2015"]
[null,"Institución ","ORGANIZACION DE LAS NACIONES UNIDAS PARA LA AGRICULTURA Y LA ALIMENTACION - FAO"]
[]
[]
[null,"Porcentaje de proteínas",null,67,"g/persona·día",null,"Relación de esta hoja, con otras:"]

{"sheet":"InfoProc 6B2a","index":5,"n_rows":181,"n_cols":9,"rows_kept":181,"cut":false,"hidden":false,"merged":[[4,5,5,5],[4,4,5,4],[1,1,1,5],[4,1,5,1],[4,2,5,2],[4,3,5,3]]}
[]
[null,"Información Procesada: Población nacional según región (millares)"]
[null,null,null,null,null,null,null,"Relación de esta hoja, con otras:"]
[]
[null,"Código","Región","Empresa Prestadora de Servicio","Tratamiento de aguas residuales [%]","Población con alcantarillado [miles]"]
[]
[null,{"$f":"'InfoBase 6B2a'!B21","v":1},{"$f":"'InfoBase 6B2a'!C21","v":"Amazonas"},{"$f":"'InfoBase 6B2a'!D21","v":"EMUSAP Amazonas"},{"$f":"VLOOKUP(D7,'InfoBase 6B2a'!$D$21:$G$70,2,FALSE)","v":0},{"$f":"VLOOKUP(D7,'InfoBase 6B2a'!$D$21:$G$70,4,FALSE)/1000","v":17.736922930264672}]
[null,{"$f":"'InfoBase 6B2a'!B27","v":7},{"$f":"'InfoBase 6B2a'!C27","v":"Amazonas"},{"$f":"'InfoBase 6B2a'!D27","v":"EPSSMU S.R.Ltda."},{"$f":"VLOOKUP(D8,'InfoBase 6B2a'!$D$21:$G$70,2,FALSE)","v":0},{"$f":"VLOOKUP(D8,'InfoBase 6B2a'!$D$21:$G$70,4,FALSE)/1000","v":15.237504858333331}]
[null,{"$f":"'InfoBase 6B2a'!B55","v":35},{"$f":"'InfoBase 6B2a'!C55","v":"Amazonas"},{"$f":"'InfoBase 6B2a'!D55","v":"EMAPAB S.R.LTDA. "},{"$f":"VLOOKUP(D9,'InfoBase 6B2a'!$D$21:$G$70,2,FALSE)","v":0},{"$f":"VLOOKUP(D9,'InfoBase 6B2a'!$D$21:$G$70,4,FALSE)/1000","v":15.794033730000001}]
[null,{"$f":"'InfoBase 6B2a'!B34","v":14},{"$f":"'InfoBase 6B2a'!C34","v":"Áncash"},{"$f":"'InfoBase 6B2a'!D34","v":"SEDACHIMBOTE S.A."},{"$f":"VLOOKUP(D10,'InfoBase 6B2a'!$D$21:$G$70,2,FALSE)","v":0.57979999999999998},{"$f":"VLOOKUP(D10,'InfoBase 6B2a'!$D$21:$G$70,4,FALSE)/1000","v":327.52152694447898}]
[null,{"$f":"'InfoBase 6B2a'!B53","v":33},{"$f":"'InfoBase 6B2a'!C53","v":"Áncash"},{"$f":"'InfoBase 6B2a'!D53","v":"EPS CHAVIN S.A."},{"$f":"VLOOKUP(D11,'InfoBase 6B2a'!$D$21:$G$70,2,FALSE)","v":0},{"$f":"VLOOKUP(D11,'InfoBase 6B2a'!$D$21:$G$70,4,FALSE)/1000","v":84.734943394639373}]
[null,{"$f":"'InfoBase 6B2a'!B63","v":43},{"$f":"'InfoBase 6B2a'!C63","v":"Apurímac"},{"$f":"'InfoBase 6B2a'!D63","v":"EMUSAP ABANCAY S.A. "},{"$f":"VLOOKUP(D12,'InfoBase 6B2a'!$D$21:$G$70,2,FALSE)","v":0},{"$f":"VLOOKUP(D12,'InfoBase 6B2a'!$D$21:$G$70,4,FALSE)/1000","v":38.544411573101989}]
[null,{"$f":"'InfoBase 6B2a'!B64","v":44},{"$f":"'InfoBase 6B2a'!C64","v":"Apurímac"},{"$f":"'InfoBase 6B2a'!D64","v":"EMSAP CHANKA S.R.L."},{"$f":"VLOOKUP(D13,'InfoBase 6B2a'!$D$21:$G$70,2,FALSE)","v":0},{"$f":"VLOOKUP(D13,'InfoBase 6B2a'!$D$21:$G$70,4,FALSE)/1000","v":13.354468473082047}]
[null,{"$f":"'InfoBase 6B2a'!B70","v":51},{"$f":"'InfoBase 6B2a'!C70","v":"Arequipa"},{"$f":"'InfoBase 6B2a'!D70","v":"SEDAPAR S.R.L. (Rioja)"},{"$f":"VLOOKUP(D14,'InfoBase 6B2a'!$D$21:$G$70,2,FALSE)","v":0},{"$f":"VLOOKUP(D14,'InfoBase 6B2a'!$D$21:$G$70,4,FALSE)/1000","v":9.7051248916042567}]
[null,{"$f":"'InfoBase 6B2a'!B35","v":15},{"$f":"'InfoBase 6B2a'!C35","v":"Ayacucho"},{"$f":"'InfoBase 6B2a'!D35","v":"EPSASA"},{"$f":"VLOOKUP(D15,'InfoBase 6B2a'!$D$21:$G$70,2,FALSE)","v":0.99719999999999998},{"$f":"VLOOKUP(D15,'InfoBase 6B2a'!$D$21:$G$70,4,FALSE)/1000","v":165.66004108622178}]
[null,{"$f":"'InfoBase 6B2a'!B31","v":11},{"$f":"'InfoBase 6B2a'!C31","v":"Cajamarca"},{"$f":"'InfoBase 6B2a'!D31","v":"SEDACAJ S.A."},{"$f":"VLOOKUP(D16,'InfoBase 6B2a'!$D$21:$G$70,2,FALSE)","v":7.4099999999999999E-2},{"$f":"VLOOKUP(D16,'InfoBase 6B2a'!$D$21:$G$70,4,FALSE)/1000","v":140.33699999999999}]
[null,{"$f":"'InfoBase 6B2a'!B65","v":45},{"$f":"'InfoBase 6B2a'!C65","v":"Cajamarca"},{"$f":"'InfoBase 6B2a'!D65","v":"EPS MARAÑON S.R.L.                 "},{"$f":"VLOOKUP(D17,'InfoBase 6B2a'!$D$21:$G$70,2,FALSE)","v":0.92779999999999996},{"$f":"VLOOKUP(D17,'InfoBase 6B2a'!$D$21:$G$70,4,FALSE)/1000","v":39.182962588028168}]
[null,{"$f":"'InfoBase 6B2a'!B29","v":9},{"$f":"'InfoBase 6B2a'!C29","v":"Cerro de Pasco"},{"$f":"'InfoBase 6B2a'!D29","v":"EMAPA Pasco S.A."},{"$f":"VLOOKUP(D18,'InfoBase 6B2a'!$D$21:$G$70,2,FALSE)","v":0},{"$f":"VLOOKUP(D18,'InfoBase 6B2a'!$D$21:$G$70,4,FALSE)/1000","v":57.122}]
[null,{"$f":"'InfoBase 6B2a'!B51","v":31},{"$f":"'InfoBase 6B2a'!C51","v":"Cusco"},{"$f":"'InfoBase 6B2a'!D51","v":"SEDACUSCO S.A. "},{"$f":"VLOOKUP(D19,'InfoBase 6B2a'!$D$21:$G$70,2,FALSE)","v":0.9294},{"$f":"VLOOKUP(D19,'InfoBase 6B2a'!$D$21:$G$70,4,FALSE)/1000","v":345.37037040960377}]
[null,{"$f":"'InfoBase 6B2a'!B54","v":34},{"$f":"'InfoBase 6B2a'!C54","v":"Cusco"},{"$f":"'InfoBase 6B2a'!D54","v":"EMAQ S.R.LTDA."},{"$f":"VLOOKUP(D20,'InfoBase 6B2a'!$D$21:$G$70,2,FALSE)","v":0},{"$f":"VLOOKUP(D20,'InfoBase 6B2a'!$D$21:$G$70,4,FALSE)/1000","v":16.755680234135315}]
{"$rows_left_out":162}
{"sheet":"Prop. y Fact. de conversión","index":6,"n_rows":68,"n_cols":6,"rows_kept":68,"cut":false,"hidden":false,"merged":[[1,1,1,3],[14,1,14,3],[12,1,12,3],[33,1,33,3],[42,1,42,3],[26,1,27,3],[29,1,29,3]]}
[]
[null,"Relación de metano/carbono y oxido nitroso/nitrógeno"]
[]
[null,"Peso atómico del carbono",12]
[null,"Peso atómico del hidrógeno",1]
[null,"Peso atómico del nitrógeno",14]
[null,"Peso atómico del oxígeno",16]
[null,"Fuente: Tabla periódica de los elementos"]
[]
[null,"Relación CH4/C",{"$f":"(C4+C5*4)/C4","v":1.3333333333333333}]
[]
[]
[null,"Conversión de unidades"]
[]
[null,"Masa"]
[null,"1 tonelada",1000,"kg"]
[null,"1 kilogramo",1000,"g"]
[null,"1 tonelada",{"$f":"C16*C17","v":1000000},"g"]
[]
[null,"Prefijo","Simbolo","Factor "]
{"$rows_left_out":49}
{"sheet":"FE 6B2","index":7,"n_rows":20,"n_cols":4,"rows_kept":20,"cut":false,"hidden":false,"merged":[[16,1,16,4],[18,3,18,4],[6,1,6,5],[8,3,8,4],[1,1,1,6],[11,1,11,4],[13,3,13,4]]}
[]
[null,"Factor de conversión de metano para el sistema de manejo (FCM)"]
[]
[null,"FCM",0.8]
[null,"Fuente: GL 1996, cuadro 6-7, página 6.20 "]
[]
[null,"Capacidad máxima de producción de metano (Bo)"]
[]
[null,"Bo",0.6,"kg CH4/kg DBO"]
[null,"Fuente: OBP 2000, página 5.18"]
[]
[null,"Fracción de nitrógeno en la proteína"]
[]
[null,"FracNPR",0.16,"Kg N/Kg proteína"]
[null,"Fuente: IPCC 1996, página 6.25"]
[]
[null,"Factor de emisión por excretas humanas"]
[]
[null,"EF6",0.01,"kgCH4/kgDBO"]
[null,"Fuente: IPCC 1996, página 6.25"]
{"$rows_left_out":1}
{"sheet":"Emisiones GEI 6B2a","index":8,"n_rows":63,"n_cols":16,"rows_kept":63,"cut":false,"hidden":false,"merged":[[1,1,1,6],[3,2,3,3],[4,2,4,3],[5,2,5,3]]}
[]
[null,"Estimación de metano generado por el tratamiento de aguas residuales domésticas "]
[]
[null,"Sector","Desechos"]
[null,"Categoría","Aguas residuales domésticas"]
[null,"Código de categoría","6B2a"]
[]
[]
[]
[null,"A","B","C","D","E","F","G","H","I","J","K","L","M","N","O"]
[null,"Región - EPS","Población con alcantarillado               \n(1,000 personas)","Componente orgánico degradable                       \n(kg DBO/1000 personas/año)    ","Fracción del componente orgánico degradable removido como lodo","Total del componente orgánico del agua residual doméstica residual/comercial                       \n(kg DBO/año)","Total  del componente orgánico del lodo doméstico/comercial                        \n(kg DBO/año)","Sistemas de manejo de aguas residuales ","Fracción de agua residual tratada por el sistema de manejo","Factor de conversión de metano para el sistema de manejo","Producto","Capacidad máxima de producción de metano\n(kg CH4/kg DBO)","Factor de emisión para aguas residuales domésticas\n(kg CH4/kg DBO)","Emisiones de metano sin recuperación o quema              \n(Kg CH4)","Metano recuperado o quemado \n(Kg CH4)","Emisiones netas de metano\n(Gg CH4)"]
[null,null,null,null,null,"E = [B x C x (1-D)]","F = (B x C x D)",null,null,null,"J = (H x I )",null,"L = (J x K)","M = (E x L)",null,"K = (M - N)/1 000 000"]
[null,{"$f":"'InfoProc 6B2a'!C7& \"- \" & 'InfoBase 6B2a'!D21","v":"Amazonas- EMUSAP Amazonas"},{"$f":"'InfoProc 6B2a'!F7","v":17.736922930264672},{"$f":"'InfoProc 6B2a'!$C$92","v":18250},0,{"$f":"(C13*D13*(1-E13))","v":323698.84347733029},{"$f":"C13*D13*E13","v":0},null,{"$f":"'InfoProc 6B2a'!E7","v":0},{"$f":"'FE 6B2'!C4","v":0.8},{"$f":"I13*J13","v":0},{"$f":"'FE 6B2'!C9","v":0.6},{"$f":"K13*L13","v":0},{"$f":"F13*M13","v":0},{"$f":"M13","v":0},{"$f":"(N13-O13)/1000000","v":0}]
[null,{"$f":"'InfoProc 6B2a'!C8& \"- \" & 'InfoBase 6B2a'!D22","v":"Amazonas- SEDA Huánuco S.A."},{"$f":"'InfoProc 6B2a'!F8","v":15.237504858333331},{"$f":"'InfoProc 6B2a'!$C$92","v":18250},0,{"$f":"(C14*D14*(1-E14))","v":278084.46366458328},{"$f":"C14*D14*E14","v":0},null,{"$f":"'InfoProc 6B2a'!E8","v":0},{"$f":"'FE 6B2'!C4","v":0.8},{"$f":"I14*J14","v":0},{"$f":"'FE 6B2'!C9","v":0.6},0,0,{"$f":"M14","v":0},{"$f":"(N14-O14)/1000000","v":0}]
[null,{"$f":"'InfoProc 6B2a'!C9& \"- \" & 'InfoBase 6B2a'!D23","v":"Amazonas- EMAPACOP S.A."},{"$f":"'InfoProc 6B2a'!F9","v":15.794033730000001},{"$f":"'InfoProc 6B2a'!$C$92","v":18250},0,288241.11557249998,0,null,{"$f":"'InfoProc 6B2a'!E9","v":0},{"$f":"'FE 6B2'!C4","v":0.8},0,{"$f":"'FE 6B2'!C9","v":0.6},0,0,{"$f":"M15","v":0},0]
[null,{"$f":"'InfoProc 6B2a'!C10& \"- \" & 'InfoBase 6B2a'!D24","v":"Áncash- EPS SEDALORETO S.A."},{"$f":"'InfoProc 6B2a'!F10","v":327.52152694447898},{"$f":"'InfoProc 6B2a'!$C$92","v":18250},0,5977267.8667367417,0,null,{"$f":"'InfoProc 6B2a'!E10","v":0.57979999999999998},{"$f":"'FE 6B2'!C4","v":0.8},0.46384000000000003,{"$f":"'FE 6B2'!C9","v":0.6},0.278304,1663497.5563843022,{"$f":"M16","v":0.278304},1.6634972780803023]
[null,{"$f":"'InfoProc 6B2a'!C11& \"- \" & 'InfoBase 6B2a'!D25","v":"Áncash- EMAPA Cañete S.A."},{"$f":"'InfoProc 6B2a'!F11","v":84.734943394639373},{"$f":"'InfoProc 6B2a'!$C$92","v":18250},0,1546412.7169521686,0,null,{"$f":"'InfoProc 6B2a'!E11","v":0},{"$f":"'FE 6B2'!C4","v":0.8},0,{"$f":"'FE 6B2'!C9","v":0.6},0,0,{"$f":"M17","v":0},0]
[null,{"$f":"'InfoProc 6B2a'!C12& \"- \" & 'InfoBase 6B2a'!D26","v":"Apurímac- EMSA Puno S.A."},{"$f":"'InfoProc 6B2a'!F12","v":38.544411573101989},{"$f":"'InfoProc 6B2a'!$C$92","v":18250},0,703435.51120911131,0,null,{"$f":"'InfoProc 6B2a'!E12","v":0},{"$f":"'FE 6B2'!C4","v":0.8},0,{"$f":"'FE 6B2'!C9","v":0.6},0,0,{"$f":"M18","v":0},0]
[null,{"$f":"'InfoProc 6B2a'!C13& \"- \" & 'InfoBase 6B2a'!D27","v":"Apurímac- EPSSMU S.R.Ltda."},{"$f":"'InfoProc 6B2a'!F13","v":13.354468473082047},{"$f":"'InfoProc 6B2a'!$C$92","v":18250},0,243719.04963374735,0,null,{"$f":"'InfoProc 6B2a'!E13","v":0},{"$f":"'FE 6B2'!C4","v":0.8},0,{"$f":"'FE 6B2'!C9","v":0.6},0,0,{"$f":"M19","v":0},0]
[null,{"$f":"'InfoProc 6B2a'!C14& \"- \" & 'InfoBase 6B2a'!D28","v":"Arequipa- Aguas de Tumbes"},{"$f":"'InfoProc 6B2a'!F14","v":9.7051248916042567},{"$f":"'InfoProc 6B2a'!$C$92","v":18250},0,177118.52927177769,0,null,{"$f":"'InfoProc 6B2a'!E14","v":0},{"$f":"'FE 6B2'!C4","v":0.8},0,{"$f":"'FE 6B2'!C9","v":0.6},0,0,{"$f":"M20","v":0},0]
{"$rows_left_out":44}
{"sheet":"Emisiones GEI 6B2b","index":9,"n_rows":14,"n_cols":10,"rows_kept":14,"cut":false,"hidden":false,"merged":[[1,1,1,9],[3,2,3,3],[4,2,4,3],[5,2,5,3]]}
[]
[null,"Estimación de óxido nitroso generado por excretas humanas"]
[]
[null,"Sector","Desechos"]
[null,"Categoría","Aguas residuales domésticas"]
[null,"Código de categoría","6B2b"]
[]
[]
[]
[null,null,"A","B","C","D","E","F","G","H"]
[null,null,"Consumo per-cápita de proteínas \n(Kg proteína/persona/año)","Población (número)","Fracción de Nitrógeno en la proteína \n(Kg N/Kg proteína)","Cantidad de N en las excretas producidas \n(Kg N/año)","Cantidad de N en la orina \n(Kg N/año)","Cantidad neta de N en la orina producida \n(Kg N/año)","Factor de Emisión \n(Kg N2O-N/Kg N en el excremento producido)","Total Anual de Emisiones de N2O \n(Gg N2O/año)"]
[]
[null,null,null,null,null,"D = A x B x C",null,"F = D - E",null,"H = (F x G) x  (44/28) / 1 000 000"]
[null,"Total ",{"$f":"'InfoBase 6B2b'!D17/'Prop. y Fact. de conversión'!C17*365","v":24.455000000000002},{"$f":"'InfoBase 6B2b(población)'!D18","v":29461933},{"$f":"'FE 6B2'!C14","v":0.16},{"$f":"C14*D14*E14","v":115278651.44240002},0,{"$f":"F14-G14","v":115278651.44240002},{"$f":"'FE 6B2'!C19","v":0.01},{"$f":"(H14*I14)*(44/28)/1000000","v":1.8115216655234287}]

{"sheet":"Resultados INGEI","index":10,"n_rows":13,"n_cols":10,"rows_kept":13,"cut":false,"hidden":false,"merged":[[3,1,3,4]]}
[]
[null,"Inventario de emisiones de gases de efecto invernadero para sector Desechos - 2010"]
[]
[null,"Código de categorías de fuentes 1996*",null,null,null,"Categorías de fuentes y sumideros","Dióxido de carbono\n[GgCO2]","Metano\n[MgCH4]","Óxido nitroso\n[MgN2O]","Emisiones de GEI\n[GgCO2e]"]
[null,6,null,null,null,"Desechos",{"$f":"G6+G8","v":0},{"$f":"H6+H8","v":40595.5279425466},1811.5216655234287,{"$f":"J6+J8","v":1414.0778}]
[null,null,"6A",null,null,"Disposición de residuos sólidos",{"$f":"SUM(G7)","v":0}]
[null,null,null,"6A1",null,"Residuos sólidos"]
[null,null,"6B",null,null,"Tratamiento de aguas residuales",{"$f":"SUM(G9:G10)","v":0},{"$f":"SUM(H9:H10)","v":40595.5279425466},{"$f":"SUM(I9:I10)","v":1811.5216655234287},{"$f":"SUM(J9:J10)","v":1414.0778}]
[null,null,null,"6B1",null,"Efluentes industriales"]
[null,null,null,"6B2",null,"Tratamiento y eliminación de aguas residuales domésticas",{"$f":"SUM(G11:G12)","v":0},{"$f":"SUM(H11:H12)","v":40595.5279425466},1811.5216655234287,1414.0778]
[null,null,null,null,"6B2a","Aguas residuales domésticas",0,{"$f":"'Emisiones GEI 6B2a'!P63*1000","v":40595.5279425466},0,{"$f":"ROUND(G11+H11*21/1000+I11*310/1000,4)","v":852.50609999999995}]
[null,null,null,null,"6B2b","Excretas humanas",0,0,{"$f":"'Emisiones GEI 6B2b'!J14*1000","v":1811.5216655234287},561.57169999999996]
[null,"* Han sido creadas para el INGEI 6A1, 6B2a y 6B2b (ver hoja de caracterización)"]