{"text_format":"1","workbook":"xlsx","n_sheets":11,"sheets":["Instrucciones","Características datos","InfoBase 6B2a","InfoBase 6B2b (población)","InfoBase 6B2b","InfoProc 6B2a","Prop. y Fact. de conversión","FE 6B2","Emisiones GEI 6B2a","Emisiones GEI 6B2b","Resultados INGEI"],"not_rendered":{"charts":2,"images":24,"macros":1,"external_links":0,"defined_names":1,"comments":4,"pivot_tables":0},"unopened":[],"bounds":{"document_bytes":16777216,"sheet_cells":100000,"rows_first":2000,"rows_last":500,"rows_between":2000,"halvings":0,"cell_chars":16384,"cell_head_chars":4096},"cells_cut":0,"cells_raw":0,"read":"whole","date_system":"1900"}

{"sheet":"Instrucciones","index":0,"n_rows":73,"n_cols":9,"rows_kept":73,"cut":false,"hidden":false,"merged":[[65,1,65,17],[24,5,24,17],[25,5,26,17],[27,5,27,17],[30,1,30,17],[33,2,33,8],[34,2,34,8],[35,2,35,8],[36,2,36,8],[37,2,37,8],[38,2,38,8],[39,2,39,8],[11,1,11,6],[1,1,1,17],[2,1,2,17],[14,1,14,17],[5,1,5,17],[7,1,7,17],[8,1,9,13]]}
[]
[null,"REPORTE ANUAL DE GASES DE EFECTO INVERNADERO "]
[null,"Sector Desechos"]
[null,null,null,null,null,null,null,null,"Tratamiento y eliminación de aguas residuales domésticas"]
[]
[null,"INSTRUCCIONES "]
[]
[null,"ALCANCE"]
[null,"El Tratamiento y eliminación de aguas residuales domésticas, involucra a todas las emisiones de gases de efecto invernadero que se generan por la descomposición de aguas residuales domésticas en condiciones anaeróbicas. Se contabilizan además las emisiones procedentes de las excretas humanas."]
[]
[]
[null,"El Tratamiento y eliminación de aguas residuales domésticas, comprende las siguientes fuentes:\n\n- Aguas residuales domésticas. \n- Excretas humanas"]
[]
[]
[null,"METODOLOGÍA DE CALCULO"]
[]
[null,"Directrices del IPCC para Inventarios Nacionales del IPCC - 1996 (GL 1996) en lo que respecta a aguas residuales"]
[null,"Orientación del IPCC sobre las buenas prácticas y la gestión de la incertidumbre en los inventarios nacionales de Gases de Efecto Invernadero (OBP 2000)"]
[null,"Sector: Desechos"]
[null,null,null,null,null,"Para el cálculo de Emisiones GEI:"]
{"$rows_left_out":54}
{"sheet":"Características datos","index":1,"n_rows":18,"n_cols":15,"rows_kept":18,"cut":false,"hidden":false,"merged":[[10,4,12,4],[10,3,12,3],[10,2,12,2],[10,10,11,10],[1,1,1,14],[6,1,6,4],[10,14,11,14],[13,1,14,1],[10,1,12,1],[13,11,14,11],[13,12,14,12],[10,11,12,11],[10,6,12,6],[10,5,12,5],[10,12,12,12],[13,5,14,5],[13,4,14,4],[13,3,14,3],[13,6,14,6],[13,2,14,2]]}
[]
[null,"Caracterización de Datos - Sector Desechos (Tratamiento y eliminación de aguas residuales domésticas)"]
[null,"Definición IPCC: se refiere a la definición -literal o abreviada- de las GL1996. En algunos casos la definición abreviada se acompaña de un comentario (columna G) con la definición literal"]
[null,"Definición INGEI: se refiere a la definición de las GL1996, ajustada a la realidad o circunstancias del Perú. Este ajuste se identificó en el desarrollo del INGEI y mantiene el concepto general de la definición original en las GL1996"]
[null,null,"No aplica o no se considera en este INGEI"]
[]
[null,"Categorización",null,null,null,"Fuente de emisión / captura","Definición","Nivel de actividad","Unidad","TIER/Nivel","Fuente de información","Uso de la información","Gases de GEI generados por el nivel de actividad","Comentarios","Hojas relacionada"]
[null,6,null,null,null,"Desechos"]
[null,null,"6B",null,null,"Tratamiento de aguas residuales","Definición IPCC: Metano y óxido nitroso generados por la descomposición de materia orgánica en las aguas.residuales.\nDefinición INGEI: metano y óxido nitroso generados por la descomposición de materia orgánica en las aguas residuales industriales y domésticas ."]
[null,null,null,"6B2",null,"Tratamiento y eliminación de aguas residuales domésticas","Definición IPCC: Emisiones de metano que se generan en los tratamientos de aguas residuales y lodos procedentes de las viviendas y fuentes comerciales. Se consideran además las emisiones de oxido nitroso procedentes de las excretas humanas vertidas en ambientes acuáticos. \n\nDefinición INGEI: Emisiones de metano generadas en los procesos de tratamiento de aguas residuales domésticas."]
[null,null,null,null,"6B2a","Aguas residuales domésticas","Definición IPCC: Manejo de aguas residuales y lodo, de fuentes domésticas y comerciales (incluyendo residuos humanos), a través de la recolección y tratamiento de aguas residuales, letrinas o descarga en fuentes de agua. \n\nDefinición INGEI: Emisiones de metano generadas en los procesos de tratamiento de aguas residuales domésticas, considerando los vertimientos al alcatarillado público.","Población servida con alcantarillado","número de personas en miles",1,"Superintendencia Nacional de Servicios de Saneamiento (SUNASS)","Sirven para determinar en su conjunto las emisiones de metano generadas por el tratamiento de las aguas residuales domésticas.","CH4",null,"InfoProc 6B2a"]
[null,null,null,null,null,null,null,"Tratamiento de aguas residuales","%",1]
[null,null,null,null,null,null,null,"Demanda Biológica de Oxígeno (DBO)","Kg DBO/1000 pesonas∙año",1,"Reglamento Nacional de Edificaciones – Norma OS.090: Plantas de Tratamiento de Aguas Residuales. \nLas unidades originales deben ser: g/hab∙dia ",null,null,null,"Prop. y Fact. de conversión\n"]
[null,null,null,null,"6B2b","Excretas humanas","Definición IPCC: Las emisiones de N2O de las excretas humanas, están directamente relacionadas al ciclo del nitrógeno en la Agricultura. \n\nDefinición INGEI: se considera las emisiones indirectas de N2O por la ingesta de proteinas en la población. Estas emisiones no son consideradas en Agricultura y forman parte de las \"Aguas residuales domésticas\", que solo contabilizan CH4.","Población nacional","número de personas en miles",null,"Instituto Nacional de Estadísticas e Informática (INEI)","Sirve para determinar la cantidad de nitrógeno contenida en la orina humana","N2O",null,"infoBase6B2b(población)"]
[null,null,null,null,null,null,null,"Consumo de proteínas","g/persona∙día",1,"Instituto Nacional de Salud",null,null,null,"InfoBase 6B2b"]
[]
[]
[null,null,null,null,null,null,null,null,null,null,null,null,null,"g/hab∙día"]

{"sheet":"InfoBase 6B2a","index":2,"n_rows":67,"n_cols":12,"rows_kept":67,"cut":false,"hidden":false,"merged":[[9,3,9,4],[9,6,9,7],[10,2,10,8],[12,1,13,1],[15,3,16,3],[15,1,16,1],[15,5,16,5],[15,2,16,2],[15,4,16,4],[1,1,1,8],[3,1,3,8],[4,2,4,8],[5,2,5,8],[6,1,8,1],[6,3,6,8],[7,3,7,8],[8,3,8,8]]}
[]
[null,"Información Básica: Tratamiento de aguas residuales y población servida con alcantarillado"]
[null,null,null,null,null,null,null,null,null,null,"Relación de esta hoja, con otras:"]
[null,"DATOS DE LA INFORMACIÓN BASE"]
[null,"Código","6B2"]
[null,"Subcodigo ","6B2a"]
[null,"Información ","Nivel de actividad","Tratamiento de aguas residuales (%) y población servida con alcantarillado (población)"]
[null,null,"Documento",null,null,null,null,null,null,null,null,"Llenar información en estas celdas"]
[null,null,"Título "]
[null,"Ubicación especifica","Pagina",null,null,"Cuadro",null,null,"Anexo "]
[null,"Vínculo"]
[null,"Institución informante:"]
[null,"Dirección de línea:\nEntidad:"]
[]
[]
[null,"Código","Región","Empresa Prestadora de Servicio","Tratamiento de aguas residuales \n(%)","Población servida con alcantarillado\n(habitantes)"]
[]
[null,1,"Amazonas","EMUSAP Amazonas"]
[null,7,"Amazonas","EPSSMU S.R.Ltda."]
[null,35,"Amazonas","EMAPAB S.R.LTDA. "]
{"$rows_left_out":48}
{"sheet":"InfoBase 6B2b (población)","index":3,"n_rows":28,"n_cols":9,"rows_kept":28,"cut":false,"hidden":false,"merged":[[13,1,14,1],[10,1,11,1],[9,3,9,4],[9,6,9,7],[10,2,10,9],[11,2,11,9],[1,1,1,9],[3,1,3,9],[4,2,4,9],[5,2,5,9],[6,1,8,1],[6,3,6,9],[7,3,7,9],[8,3,8,9]]}
[]
[null,"Información Básica: Población nacional"]
[]
[null,"DATOS DE LA INFORMACIÓN BASE"]
[null,"Código","6B2"]
[null,"Subcodigo ","6B2b"]
[null,"Información ","Nivel de actividad","Población nacional del Perú"]
[null,null,"Documento"]
[null,null,"Título "]
[null,"Ubicación especifica","Pagina",null,null,"Cuadro",null,null,"Anexo "]
[null,"Vínculo"]
[]
[null,"Institución informante:"]
[null,"Dirección de línea:\nEntidad:"]
[]
[]
[]
[null,null,"Población total oficial del Perú:",null,null,null,null,"Relación de esta hoja, con otras:"]
[]
[]
{"$rows_left_out":9}
{"sheet":"InfoBase 6B2b","index":4,"n_rows":26,"n_cols":9,"rows_kept":26,"cut":false,"hidden":false,"merged":[[1,1,1,9],[3,1,3,9],[4,2,4,9],[5,2,5,9],[6,1,8,1],[6,3,6,9],[7,3,7,9],[8,3,8,9],[16,1,16,2],[9,3,9,4],[9,6,9,7],[10,2,10,9],[10,1,11,1],[11,2,11,9],[13,1,14,1]]}
[]
[null,"Consumo diario de proteínas"]
[]
[null,"DATOS DE LA INFORMACIÓN BASE"]
[null,"Código","6B"]
[null,"Subcodigo ","6B2a"]
[null,"Información ","Nivel de actividad","Consumo de proteína per cápita"]
[null,null,"Documento"]
[null,null,"Título "]
[null,"Ubicación especifica","Pagina",null,null,"Cuadro",null,null,"Anexo "]
[null,"Vínculo"]
[]
[null,"Institución informante:"]
[null,"Dirección de línea:\nEntidad:"]
[]
[]
[null,"Porcentaje de proteínas",null,null,"g/persona·día",null,"Relación de esta hoja, con otras:"]
[]
[]
[]
{"$rows_left_out":7}
{"sheet":"InfoProc 6B2a","index":5,"n_rows":124,"n_cols":8,"rows_kept":124,"cut":false,"hidden":false,"merged":[[3,5,4,5],[3,4,4,4],[1,1,1,5],[3,1,4,1],[3,2,4,2],[3,3,4,3]]}
[]
[null,"Información Procesada: Población nacional según región (millares)"]
[null,null,null,null,null,null,null,"Relación de esta hoja, con otras:"]
[null,"Código","Región","Empresa Prestadora de Servicio","Tratamiento de aguas residuales [%]","Población con alcantarillado \n[miles]"]
[]
[null,{"$f":"'InfoBase 6B2a'!B18","v":1},{"$f":"'InfoBase 6B2a'!C18","v":"Amazonas"},{"$f":"'InfoBase 6B2a'!D18","v":"EMUSAP Amazonas"},{"$f":"VLOOKUP(D6,'InfoBase 6B2a'!$D$18:$F$67,2,FALSE)","v":0},{"$f":"VLOOKUP(D6,'InfoBase 6B2a'!$D$18:$F$67,3,FALSE)/1000","v":0}]
[null,{"$f":"'InfoBase 6B2a'!B19","v":7},{"$f":"'InfoBase 6B2a'!C19","v":"Amazonas"},{"$f":"'InfoBase 6B2a'!D19","v":"EPSSMU S.R.Ltda."},{"$f":"VLOOKUP(D7,'InfoBase 6B2a'!$D$18:$F$67,2,FALSE)","v":0},{"$f":"VLOOKUP(D7,'InfoBase 6B2a'!$D$18:$F$67,3,FALSE)/1000","v":0}]
[null,{"$f":"'InfoBase 6B2a'!B20","v":35},{"$f":"'InfoBase 6B2a'!C20","v":"Amazonas"},{"$f":"'InfoBase 6B2a'!D20","v":"EMAPAB S.R.LTDA. "},{"$f":"VLOOKUP(D8,'InfoBase 6B2a'!$D$18:$F$67,2,FALSE)","v":0},{"$f":"VLOOKUP(D8,'InfoBase 6B2a'!$D$18:$F$67,3,FALSE)/1000","v":0}]
[null,{"$f":"'InfoBase 6B2a'!B21","v":14},{"$f":"'InfoBase 6B2a'!C21","v":"Áncash"},{"$f":"'InfoBase 6B2a'!D21","v":"SEDACHIMBOTE S.A."},{"$f":"VLOOKUP(D9,'InfoBase 6B2a'!$D$18:$F$67,2,FALSE)","v":0},{"$f":"VLOOKUP(D9,'InfoBase 6B2a'!$D$18:$F$67,3,FALSE)/1000","v":0}]
[null,{"$f":"'InfoBase 6B2a'!B22","v":33},{"$f":"'InfoBase 6B2a'!C22","v":"Áncash"},{"$f":"'InfoBase 6B2a'!D22","v":"EPS CHAVIN S.A."},{"$f":"VLOOKUP(D10,'InfoBase 6B2a'!$D$18:$F$67,2,FALSE)","v":0},{"$f":"VLOOKUP(D10,'InfoBase 6B2a'!$D$18:$F$67,3,FALSE)/1000","v":0}]
[null,{"$f":"'InfoBase 6B2a'!B23","v":43},{"$f":"'InfoBase 6B2a'!C23","v":"Apurímac"},{"$f":"'InfoBase 6B2a'!D23","v":"EMUSAP ABANCAY S.A. "},{"$f":"VLOOKUP(D11,'InfoBase 6B2a'!$D$18:$F$67,2,FALSE)","v":0},{"$f":"VLOOKUP(D11,'InfoBase 6B2a'!$D$18:$F$67,3,FALSE)/1000","v":0}]
[null,{"$f":"'InfoBase 6B2a'!B24","v":44},{"$f":"'InfoBase 6B2a'!C24","v":"Apurímac"},{"$f":"'InfoBase 6B2a'!D24","v":"EMSAP CHANKA S.R.L."},{"$f":"VLOOKUP(D12,'InfoBase 6B2a'!$D$18:$F$67,2,FALSE)","v":0},{"$f":"VLOOKUP(D12,'InfoBase 6B2a'!$D$18:$F$67,3,FALSE)/1000","v":0}]
[null,{"$f":"'InfoBase 6B2a'!B25","v":51},{"$f":"'InfoBase 6B2a'!C25","v":"Arequipa"},{"$f":"'InfoBase 6B2a'!D25","v":"SEDAPAR S.R.L. (Rioja)"},{"$f":"VLOOKUP(D13,'InfoBase 6B2a'!$D$18:$F$67,2,FALSE)","v":0},{"$f":"VLOOKUP(D13,'InfoBase 6B2a'!$D$18:$F$67,3,FALSE)/1000","v":0}]
[null,{"$f":"'InfoBase 6B2a'!B26","v":15},{"$f":"'InfoBase 6B2a'!C26","v":"Ayacucho"},{"$f":"'InfoBase 6B2a'!D26","v":"EPSASA"},{"$f":"VLOOKUP(D14,'InfoBase 6B2a'!$D$18:$F$67,2,FALSE)","v":0},{"$f":"VLOOKUP(D14,'InfoBase 6B2a'!$D$18:$F$67,3,FALSE)/1000","v":0}]
[null,{"$f":"'InfoBase 6B2a'!B27","v":11},{"$f":"'InfoBase 6B2a'!C27","v":"Cajamarca"},{"$f":"'InfoBase 6B2a'!D27","v":"SEDACAJ S.A."},{"$f":"VLOOKUP(D15,'InfoBase 6B2a'!$D$18:$F$67,2,FALSE)","v":0},{"$f":"VLOOKUP(D15,'InfoBase 6B2a'!$D$18:$F$67,3,FALSE)/1000","v":0}]
[null,{"$f":"'InfoBase 6B2a'!B28","v":45},{"$f":"'InfoBase 6B2a'!C28","v":"Cajamarca"},{"$f":"'InfoBase 6B2a'!D28","v":"EPS MARAÑON S.R.L.                 "},{"$f":"VLOOKUP(D16,'InfoBase 6B2a'!$D$18:$F$67,2,FALSE)","v":0},{"$f":"VLOOKUP(D16,'InfoBase 6B2a'!$D$18:$F$67,3,FALSE)/1000","v":0}]
[null,{"$f":"'InfoBase 6B2a'!B29","v":9},{"$f":"'InfoBase 6B2a'!C29","v":"Cerro de Pasco"},{"$f":"'InfoBase 6B2a'!D29","v":"EMAPA Pasco S.A."},{"$f":"VLOOKUP(D17,'InfoBase 6B2a'!$D$18:$F$67,2,FALSE)","v":0},{"$f":"VLOOKUP(D17,'InfoBase 6B2a'!$D$18:$F$67,3,FALSE)/1000","v":0}]
[null,{"$f":"'InfoBase 6B2a'!B30","v":31},{"$f":"'InfoBase 6B2a'!C30","v":"Cusco"},{"$f":"'InfoBase 6B2a'!D30","v":"SEDACUSCO S.A. "},{"$f":"VLOOKUP(D18,'InfoBase 6B2a'!$D$18:$F$67,2,FALSE)","v":0},{"$f":"VLOOKUP(D18,'InfoBase 6B2a'!$D$18:$F$67,3,FALSE)/1000","v":0}]
[null,{"$f":"'InfoBase 6B2a'!B31","v":34},{"$f":"'InfoBase 6B2a'!C31","v":"Cusco"},{"$f":"'InfoBase 6B2a'!D31","v":"EMAQ S.R.LTDA."},{"$f":"VLOOKUP(D19,'InfoBase 6B2a'!$D$18:$F$67,2,FALSE)","v":0},{"$f":"VLOOKUP(D19,'InfoBase 6B2a'!$D$18:$F$67,3,FALSE)/1000","v":0}]
[null,{"$f":"'InfoBase 6B2a'!B32","v":38},{"$f":"'InfoBase 6B2a'!C32","v":"Cusco"},{"$f":"'InfoBase 6B2a'!D32","v":"EMPSSAPAL S.A."},{"$f":"VLOOKUP(D20,'InfoBase 6B2a'!$D$18:$F$67,2,FALSE)","v":0},{"$f":"VLOOKUP(D20,'InfoBase 6B2a'!$D$18:$F$67,3,FALSE)/1000","v":0}]
{"$rows_left_out":105}
{"sheet":"Prop. y Fact. de conversión","index":6,"n_rows":66,"n_cols":6,"rows_kept":66,"cut":false,"hidden":false,"merged":[[33,1,34,1],[1,1,1,3],[12,1,12,3],[10,1,10,3],[31,1,31,3],[24,1,25,3],[27,1,27,3]]}
[]
[null,"Relación de metano/carbono y oxido nitroso/nitrógeno"]
[]
[null,"Peso atómico del carbono",12]
[null,"Peso atómico del hidrógeno",1]
[null,"Peso atómico del nitrógeno",14]
[null,"Peso atómico del oxígeno",16]
[null,"Relación CH4/C",{"$f":"(C4+C5*4)/C4","v":1.3333333333333333}]
[null,"Fuente: Tabla periódica de los elementos"]
[]
[null,"Conversión de unidades"]
[]
[null,"Masa"]
[null,"1 tonelada",1000,"kg"]
[null,"1 kilogramo",1000,"g"]
[null,"1 tonelada",{"$f":"C14*C15","v":1000000},"g"]
[]
[null,"Prefijo","Simbolo","Factor "]
[null,"deca","da",{"$f":"10^1","v":10}]
[null,"hecto","h",{"$f":"10^2","v":100}]
{"$rows_left_out":47}
{"sheet":"FE 6B2","index":7,"n_rows":20,"n_cols":4,"rows_kept":20,"cut":false,"hidden":false,"merged":[[16,1,16,4],[18,3,18,4],[6,1,6,5],[8,3,8,4],[1,1,1,6],[11,1,11,4],[13,3,13,4]]}
[]
[null,"Factor de conversión de metano para el sistema de manejo (FCM)"]
[]
[null,"FCM",0.8]
[null,"Fuente: GL 1996, cuadro 6-7, página 6.20 "]
[]
[null,"Capacidad máxima de producción de metano (Bo)"]
[]
[null,"Bo",0.6,"kg CH4/kg DBO"]
[null,"Fuente: OBP 2000, página 5.18"]
[]
[null,"Fracción de nitrógeno en la proteína"]
[]
[null,"FracNPR",0.16,"Kg N/Kg proteína"]
[null,"Fuente: IPCC 1996, página 6.25"]
[]
[null,"Factor de emisión por excretas humanas"]
[]
[null,"EF6",0.01,"kgCH4/kgDBO"]
[null,"Fuente: IPCC 1996, página 6.25"]
{"$rows_left_out":1}
{"sheet":"Emisiones GEI 6B2a","index":8,"n_rows":65,"n_cols":16,"rows_kept":65,"cut":false,"hidden":false,"merged":[[1,1,1,6],[3,2,3,3],[4,2,4,3],[5,2,5,3]]}
[]
[null,"Estimación de metano generado por el tratamiento de aguas residuales domésticas "]
[]
[null,"Sector","Desechos"]
[null,"Categoría","Aguas residuales domésticas"]
[null,"Código de categoría","6B2a"]
[]
[]
[]
[]
[]
[null,"A","B","C","D","E","F","G","H","I","J","K","L","M","N","O"]
[null,"Región - EPS","Población con alcantarillado               \n(1,000 personas)","Componente orgánico degradable                       \n(kg DBO/1000 personas/año)    ","Fracción del componente orgánico degradable removido como lodo","Total del componente orgánico del agua residual doméstica residual/comercial                       \n(kg DBO/año)","Total  del componente orgánico del lodo doméstico/comercial                        \n(kg DBO/año)","Sistemas de manejo de aguas residuales ","Fracción de agua residual tratada por el sistema de manejo","Factor de conversión de metano para el sistema de manejo","Fracción real de metano","Capacidad máxima de producción de metano\n(kg CH4/kg DBO)","Factor de emisión para aguas residuales domésticas\n(kg CH4/kg DBO)","Emisiones de metano sin recuperación o quema              \n(Kg CH4)","Metano recuperado o quemado \n(Kg CH4)","Emisiones netas de metano\n(Gg CH4)"]
[null,null,null,null,null,"E = [ B x C  x  (1 - D) ]","F = ( B x C x D )",null,null,null,"J = (H x I )",null,"L = (J x K)","M = (E x L)",null,"K = (M - N)/1 000 000"]
[null,{"$f":"'InfoProc 6B2a'!C6& \"- \" & 'InfoBase 6B2a'!D18","v":"Amazonas- EMUSAP Amazonas"},{"$f":"'InfoProc 6B2a'!F6","v":0},{"$f":"'Prop. y Fact. de conversión'!$C$35","v":18250},0,{"$f":"(C15*D15*(1-E15))","v":0},{"$f":"C15*D15*E15","v":0},null,{"$f":"'InfoProc 6B2a'!E6","v":0},{"$f":"'FE 6B2'!C4","v":0.8},{"$f":"I15*J15","v":0},{"$f":"'FE 6B2'!C9","v":0.6},{"$f":"K15*L15","v":0},{"$f":"F15*M15","v":0},null,{"$f":"(N15-O15)/1000000","v":0}]
[null,{"$f":"'InfoProc 6B2a'!C7& \"- \" & 'InfoBase 6B2a'!D19","v":"Amazonas- EPSSMU S.R.Ltda."},{"$f":"'InfoProc 6B2a'!F7","v":0},{"$f":"'Prop. y Fact. de conversión'!$C$35","v":18250},0,{"$f":"(C16*D16*(1-E16))","v":0},{"$f":"C16*D16*E16","v":0},null,{"$f":"'InfoProc 6B2a'!E7","v":0},{"$f":"'FE 6B2'!C4","v":0.8},{"$f":"I16*J16","v":0},{"$f":"'FE 6B2'!C9","v":0.6},{"$f":"K16*L16","v":0},0,null,{"$f":"(N16-O16)/1000000","v":0}]
[null,{"$f":"'InfoProc 6B2a'!C8& \"- \" & 'InfoBase 6B2a'!D20","v":"Amazonas- EMAPAB S.R.LTDA. "},{"$f":"'InfoProc 6B2a'!F8","v":0},{"$f":"'Prop. y Fact. de conversión'!$C$35","v":18250},0,0,0,null,{"$f":"'InfoProc 6B2a'!E8","v":0},{"$f":"'FE 6B2'!C4","v":0.8},{"$f":"I17*J17","v":0},{"$f":"'FE 6B2'!C9","v":0.6},0,0,null,0]
[null,{"$f":"'InfoProc 6B2a'!C9& \"- \" & 'InfoBase 6B2a'!D21","v":"Áncash- SEDACHIMBOTE S.A."},{"$f":"'InfoProc 6B2a'!F9","v":0},{"$f":"'Prop. y Fact. de conversión'!$C$35","v":18250},0,{"$f":"(C18*D18*(1-E18))","v":0},{"$f":"C18*D18*E18","v":0},null,{"$f":"'InfoProc 6B2a'!E9","v":0},{"$f":"'FE 6B2'!C4","v":0.8},{"$f":"I18*J18","v":0},{"$f":"'FE 6B2'!C9","v":0.6},0,0,null,0]
[null,{"$f":"'InfoProc 6B2a'!C10& \"- \" & 'InfoBase 6B2a'!D22","v":"Áncash- EPS CHAVIN S.A."},{"$f":"'InfoProc 6B2a'!F10","v":0},{"$f":"'Prop. y Fact. de conversión'!$C$35","v":18250},0,0,0,null,{"$f":"'InfoProc 6B2a'!E10","v":0},{"$f":"'FE 6B2'!C4","v":0.8},0,{"$f":"'FE 6B2'!C9","v":0.6},0,0,null,0]
[null,{"$f":"'InfoProc 6B2a'!C11& \"- \" & 'InfoBase 6B2a'!D23","v":"Apurímac- EMUSAP ABANCAY S.A. "},{"$f":"'InfoProc 6B2a'!F11","v":0},{"$f":"'Prop. y Fact. de conversión'!$C$35","v":18250},0,0,0,null,{"$f":"'InfoProc 6B2a'!E11","v":0},{"$f":"'FE 6B2'!C4","v":0.8},0,{"$f":"'FE 6B2'!C9","v":0.6},0,0,null,0]
{"$rows_left_out":46}
{"sheet":"Emisiones GEI 6B2b","index":9,"n_rows":11,"n_cols":8,"rows_kept":11,"cut":false,"hidden":false,"merged":[[1,1,1,7],[3,2,3,3],[4,2,4,3],[5,2,5,3],[7,1,8,1]]}
[]
[null,"Estimación de óxido nitroso generado por excretas humanas"]
[]
[null,"Sector","Desechos"]
[null,"Categoría","Aguas residuales domésticas"]
[null,"Código de categoría","6B2b"]
[]
[null,"Fuente de residuos sólidos","A","B","C","D","E","H"]
[null,null,"Consumo per-cápita de proteínas \n(Kg proteína/persona/año)","Población (número)","Fracción de Nitrógeno en la proteína \n(Kg N/Kg proteína)","Cantidad de N en las excretas producidas \n(Kg N/año)","Factor de Emisión \n(Kg N2O-N/Kg N en el excremento producido)","Total Anual de Emisiones de N2O \n(Gg N2O/año)"]
[null,null,null,null,null,"D = A x B x C","E","H = (D x E) x  (44/28) / 1 000 000"]
[null,"Total Perú",{"$f":"'InfoBase 6B2b'!D17/'Prop. y Fact. de conversión'!C15*365","v":0},{"$f":"'InfoBase 6B2b (población)'!D18","v":0},{"$f":"'FE 6B2'!C14","v":0.16},{"$f":"C11*D11*E11","v":0},{"$f":"'FE 6B2'!C19","v":0.01},{"$f":"(F11*G11)*(44/28)/1000000","v":0}]

{"sheet":"Resultados INGEI","index":10,"n_rows":12,"n_cols":10,"rows_kept":12,"cut":false,"hidden":false,"merged":[[3,1,3,4]]}
[]
[null,"REPORTE ANUAL DE GASES DE EFECTO INVERNADERO - SECTOR DESECHOS  - TRATAMIENTO Y ELIMINACIÓN DE AGUAS RESIDUALES DOMÉSTICAS"]
[]
[null,"Código de categorías de fuentes 1996",null,null,null,"Categorías de fuentes y sumideros","Dióxido de carbono\n[GgCO2]","Metano\n[MgCH4]","Óxido nitroso\n[MgN2O]","Emisiones de GEI\n[GgCO2e]"]
[null,6,null,null,null,"Desechos",{"$f":"G6+G8","v":0},{"$f":"H6+H8","v":0},0,{"$f":"J6+J8","v":0}]
[null,null,"6A",null,null,"Disposición de residuos sólidos",{"$f":"SUM(G7)","v":0}]
[null,null,null,"6A1",null,"Residuos sólidos"]
[null,null,"6B",null,null,"Tratamiento de aguas residuales",{"$f":"SUM(G9:G10)","v":0},{"$f":"SUM(H9:H10)","v":0},{"$f":"SUM(I9:I10)","v":0},{"$f":"SUM(J9:J10)","v":0}]
[null,null,null,"6B1",null,"Efluentes industriales"]
[null,null,null,"6B2",null,"Tratamiento y eliminación de aguas residuales domésticas",{"$f":"SUM(G11:G12)","v":0},{"$f":"SUM(H11:H12)","v":0},0,0]
[null,null,null,null,"6B2a","Aguas residuales domésticas",0,{"$f":"'Emisiones GEI 6B2a'!P65*1000","v":0},0,{"$f":"ROUND(G11+H11*21/1000+I11*310/1000,4)","v":0}]
[null,null,null,null,"6B2b","Excretas humanas",0,0,{"$f":"'Emisiones GEI 6B2b'!H11*1000","v":0},0]